Home > The Specified > The Specified Module Could Not Be Found Asp

The Specified Module Could Not Be Found Asp

Contents

Is suscomp.dll present in both %windir%\system32\inetsrv and %windir%\syswow64\inetsrv? Detect ASCII-art windows made of M and S characters Expressing large numbers in dialogue? The native dll had a single “Hello” method which returned “Hello World” string.

#include "StdAfx.h" #include "TestObject.h" TestObject::TestObject() {} std::string TestObject::Hello() more stack exchange communities company blog Stack Exchange Inbox Reputation and Badges sign up log in tour help Tour Start here for a quick overview of the site Help Center Detailed this contact form

Typical steps are create a virtual directory, add an application pool; or see if you can simply use Visual Studio to configure IIS to run your web application right from it's Do we know exactly where Kirk will be born? Again, thanks. First a bit of background about the application as it holds the clue to the whole thing.

Error 1 The Specified Module Could Not Be Found. (exception From Hresult 0x8007007e)

Privacy Statement| Terms of Use| Contact Us| Advertise With Us| CMS by Umbraco| Hosted on Microsoft Azure Feedback on ASP.NET| File Bugs| Support Lifecycle current community chat Stack Overflow Meta Stack Instead it gives a big error screen :( –chathuradd Jul 5 '10 at 16:25 I could be wrong too, it might not be the reason for the issue, but Rate this: Please Sign up or sign in to vote.

Learning resources Microsoft Virtual Academy Channel 9 MSDN Magazine Community Forums Blogs Codeplex Support Self support Programs BizSpark (for startups) Microsoft Imagine (for students) United States (English) Newsletter Privacy & cookies But I can't solve it. ASP is enabled on the server. System.io.filenotfoundexception The Specified Module Could Not Be Found General FAQ Ask a Question Bugs and Suggestions Article Help Forum Site Map Advertise with us About our Advertising Employment Opportunities About Us Ask a Question All Questions All Unanswered FAQ

Works in Visual Studio but not IIS7System.Runtime.InteropServices.COMException Incorrect function. (Exception from HRESULT: 0x80070001)1unable to load cpp dll.The specified module could not be found. (Exception from HRESULT: 0x8007007E)0Server Error in '/' Application. The Specified Module Could Not Be Found Exception From Hresult 0x8007007e In C# Next time you get this error message, make efficient use of the process monitor to catch the culprit.

Tags .NET Comments (0) Cancel reply Name * Email * Website Skip to The specified module could not be found. (Exception from HRESULT: 0x8007007E)-1Getting error while migrating asp.net project from VS2005/framework v2.0 to VS2010/framework v3.00On a 64-bit machine, cannot run the simplest web application Right click your web project, properties, there should be tab called web, Use Local IIS, Create Virtual Directory. –GenEric35 Jul 5 '10 at 19:45 Referencing a C++ dll can

See more: C# DLL Thank you for reading.I'm craeting an ASP.net project using ICU4net fom examplehttps://code.google.com/p/icu4net/[^] My OS is Win7 32 bit with IIS7 but when i include the ICU4NET.dll and 0x8007007e Windows 10 Hope this helps. There is a problem with the resource you are looking for, and it cannot be displayed." error page is displayed. The specified module could not be found. (Exception from HRESULT: 0x8007007E)1DllNotFoundException: Unable to load DLL 'nativrd2.dll': The specified module could not be found. (Exception from HRESULT: 0x8007007E)0Unable to load DLL 'spssio32.dll':

The Specified Module Could Not Be Found Exception From Hresult 0x8007007e In C#

Should enriched doughs pass the windowpane test? following are the steps i did : I have created a windows application and add all the dll's in the bin folder. Error 1 The Specified Module Could Not Be Found. (exception From Hresult 0x8007007e) Exception Details: System.IO.FileNotFoundException: The specified module could not be found. (Exception from HRESULT: 0x8007007E) Now i fully understand that the app cannot load some kind of resource due to a FileNotFoundException, Asp.net The Specified Module Could Not Be Found. (exception From Hresult: 0x8007007e) Next I collected process monitor trace and root cause was in front of me: w3wp.exe2012QueryOpenC:\WINNT\Microsoft.NET\Framework\v2.0.50727\Temporary ASP.NET Files\managedwrappersite\5bbb713b\7beac3fa\assembly\dl3\bfbeeb54\95e2dc78_66d5c801\UnmanagedTest.dllNAME NOT FOUND w3wp.exe2012QueryOpenC:\WINNT\system32\UnmanagedTest.dllNAME NOT FOUND w3wp.exe2012QueryOpenC:\WINNT\system\UnmanagedTest.dllNAME NOT FOUND w3wp.exe2012QueryOpenC:\WINNT\UnmanagedTest.dllNAME NOT

The specified module could not be found. (Exception from HRESULT: 0x8007007E) [Answered]RSS 2 replies Last post Apr 30, 2013 10:30 PM by dyyo ‹ Previous Thread|Next Thread › Print Share Twitter http://blackplanetsupport.com/the-specified/the-specified-module-could-not-be-found-asp-net.html The specified module could not be found. (Exception from HRESULT: 0x8007007E) Stack Trace: [FileNotFoundException: The specified module could not be found. (Exception from HRESULT: 0x8007007E)] System.Reflection.Assembly._nLoad(AssemblyName fileName, String codeBase, Evidence assemblySecurity, What are the benefits of an oral exam? Not the answer you're looking for? The Specified Module Could Not Be Found Exception From Hresult Vmware

Running in IIS seems to be much difficult task. do I just copy it to the syswow64\... Have a close look into theprobing paths of the dll :these paths are multiple values of the "PATH" environement variable on the server.Why doesw3wp.exe look for a native dll in these navigate here What does Joker “with TM” mean in the Deck of Many Things?

The bindings for the site show "http:*:80:www.mysitename.net". Msvcr71.dll Windows 7 Can you paste httpCompression section configuration from %windir%\system32\inetsrv\config\applicationHost.config? The specified module could not be found. (Excepción de HRESULT: 0x8007007E) Ocultar     en System.Windows.Forms.UnsafeNativeMethods.CoCreateInstance(Guid& clsid, Object punkOuter, Int32 context, Guid& iid) en System.Windows.Forms.AxHost.CreateWithoutLicense(Guid clsid) en System.Windows.Forms.AxHost.CreateInstanceCore(Guid clsid) en System.Windows.Forms.AxHost.CreateInstance()

please refer the stack trace : The specified module could not be found. (Exception from HRESULT: 0x8007007E) Description: An unhandled exception occurred during the execution of the current web request.

Information regarding the origin and location of the exception can be identified using the exception stack trace below. How do you express any radical root of a number? If your assembly supports only 32 bit you will this kind of error. An Attempt Was Made To Load A Program With An Incorrect Format. (exception From Hresult: 0x8007000b) Like I said earlier, maybe I went on a side track focusing on the C++ reference, if it dosen't solve, let's see if others have different input to help you solve

Spatial screwdriver Equation system with two unknown variables more hot questions question feed lang-cpp about us tour help blog chat data legal privacy policy work here advertising info mobile contact us Let's work to help developers, not make them feel stupid. Please help me someone. http://blackplanetsupport.com/the-specified/oci-dll-the-specified-module-cannot-be-found.html more hot questions question feed default about us tour help blog chat data legal privacy policy work here advertising info mobile contact us feedback Technology Life / Arts Culture / Recreation

Bruteforcing a keypad lock Ultimate Australian Canal How to plot Compressibility factor Z vs Pressure P using ParametricPlot? If you choose to participate, the online survey will be presented to you when you leave the Msdn Web site.Would you like to participate? Newby to IIS7.0 - The specified module could not be found. (0x8007007e) error [Answered]RSS 8 replies Last post Dec 02, 2010 01:13 PM by kimba1 ‹ Previous Thread|Next Thread › Print There is a reason for that as well. .NETFrameworkloads any dll present in the application bin folder as a managed dll.When we place an unmanged nativedll in that place, it fails

What is this metal rail in the basement ceiling How do you define sequences that converge to infinity? Using failed request tracing there are two warnings: 72. -MODULE_SET_RESPONSE_ERROR_STATUS ModuleName StaticCompressionModule Notification 16 HttpStatus 500 HttpReason Internal Server Error HttpSubStatus 19 ErrorCode 2147942526 ConfigExceptionInfo Notification MAP_REQUEST_HANDLER ErrorCode The specified module more stack exchange communities company blog Stack Exchange Inbox Reputation and Badges sign up log in tour help Tour Start here for a quick overview of the site Help Center Detailed Exception from HRESULT: 0x8007007E3Could not load file or assembly 'file:///C:\WINDOWS\Microsoft.NET\Framework\v4.0.30319\ asp.net vs20101appharbor WCF Service assembly is built by a runtime newer than the currently loaded runtime and cannot be loaded2Error loading

I created a folder under the root of the C: drive for my site files and added a new web site pointing to the new folder as the physical path and Please help and write to [email protected] is you get to find a solution. How to find all macOS applications which are not from the App Store? Monday, September 13, 2010 2:44 PM 0 Sign in to vote Awesome!

To host your web app in IIS, first check if IIS is fully installed on your win7, including all the sub features of IIS this version of IIS is able to The server I deployed to is Small Business Server 2008 64-bit. If any body was experienced this problem, please suggest will be thankfull. My operating system is Windows 7 Ultimate 64 bit Can I know why I m getting this error and how to resolve this ?